{"text_format":"1","workbook":"xlsx","n_sheets":3,"sheets":["SSI Template","Instructions","List"],"not_rendered":{"charts":0,"images":0,"macros":1,"external_links":0,"defined_names":1,"comments":0,"pivot_tables":0},"unopened":[],"bounds":{"document_bytes":16777216,"sheet_cells":100000,"rows_first":2000,"rows_last":500,"rows_between":2000,"halvings":0,"cell_chars":16384,"cell_head_chars":4096},"cells_cut":0,"cells_raw":0,"read":"whole","date_system":"1900"}

{"sheet":"SSI Template","index":0,"n_rows":2002,"n_cols":19,"rows_kept":2002,"cut":false,"hidden":false,"merged":[[0,3,0,4],[10,8,11,10],[8,9,8,10],[5,9,7,10],[6,5,6,6],[2,0,3,0],[4,1,4,7],[1,8,3,16],[6,1,6,2],[9,1,9,7],[7,2,8,7],[7,16,8,16],[2,1,3,2]]}
["Journal ID:","SSI0",null,"Reference Number Generator"]
[null,null,null,null,null,null,null,null,"Send to ndsu.accounting.ssi@ndsu.edu for processing.\nOnly attach one spreadsheet per email.\nCompleted spreadsheets must be submitted from an individual who is authorized to approve expenses."]
["Choose the Type of Entry:"]
[]
["Entry Type Definition:",{"$f":"INDEX(List!C1:C6,B6,0)","v":"Please Choose Type from Drop Down"}]
[null,1,null,null,null,null,null,null,null,"TOTAL OF \nAMOUNT COLUMN MUST\nEQUAL $0.00"]
["Description:","(Max 254 Characters)",null,null,null,{"$f":"IF(I7<254,\"\",\"Over 254 Characters\")","v":""},null,null,{"$f":"LEN(C8)","v":0}]
[null,{"$f":"INDEX(List!B1:B6,B6,0)","v":"Choose Type"}]
[null,null,null,null,null,null,null,null,null,{"$f":"SUM(H17:H2002)","v":0}]
[null,{"$f":"INDEX(List!D1:D6,B6,0)","v":"Please Choose Type from Drop Down.  Spreadsheet will be returned if a type is not selected."}]
[null,null,null,null,null,null,null,null,"These cells will populate automatically if a project number is used."]
[]
["NDSU1","ACTUALS","Account Number","Fund Number","Department \nNumber","Program \nNumber","Project ID","Amount","NDSU1",1,"GLE",null,null,null,null,null,"Description\n(Max 30 Characters)"]
["Do Not Input!\nCells Automatically Populate","Do Not Input!\nCells Automatically Populate","6 numeric \ncharacters","5 numeric \ncharacters","4 numeric\ncharacters ","5 numeric\ncharacters that begin with 0","10 alpha/numeric\ncharacters","Dollar amount \nof charge/credit","Do Not Input!\nCells Automatically Populate","Do Not Input!\nCells Automatically Populate","Do Not Input!\nCells Automatically Populate",null,null,null,null,null,"Examples could include Voucher ID and/or Invoice Numbers"]
["Bus. Unit","Ledger","Account","Fund","Dept.","Program","Project ID","Amount","PC Bus Unit","Project \nActivity ID","Res. \nAnalysis Type",null,null,null,null,null,"Description"]
[]
[{"$f":"IF(H17<>\"\",\"NDSU1\",\"\")","v":""},{"$f":"IF(A17<>\"\",\"ACTUALS\",\"\")","v":""},null,null,null,null,null,null,{"$f":"IF(G17<>\"\",A17,\"\")","v":""},{"$f":"IF(G17<>\"\",1,\"\")","v":""},{"$f":"IF(G17<>\"\",\"GLE\",\"\")","v":""},null,null,null,null,null,null,{"$f":"LEN(Q17)","v":0},{"$f":"IF(R17<30,\"\",\"Over 30 Characters\")","v":""}]
[{"$f":"IF(H18<>\"\",\"NDSU1\",\"\")","v":""},{"$f":"IF(A18<>\"\",\"ACTUALS\",\"\")","v":""},null,null,null,null,null,null,"",{"$f":"IF(G18<>\"\",1,\"\")","v":""},{"$f":"IF(G18<>\"\",\"GLE\",\"\")","v":""},null,null,null,null,null,null,{"$f":"LEN(Q18)","v":0},{"$f":"IF(R18<30,\"\",\"Over 30 Characters\")","v":""}]
[{"$f":"IF(H19<>\"\",\"NDSU1\",\"\")","v":""},{"$f":"IF(A19<>\"\",\"ACTUALS\",\"\")","v":""},null,null,null,null,null,null,"","","",null,null,null,null,null,null,0,""]
[{"$f":"IF(H20<>\"\",\"NDSU1\",\"\")","v":""},"",null,null,null,null,null,null,"","","",null,null,null,null,null,null,0,""]
["","",null,null,null,null,null,null,"","","",null,null,null,null,null,null,0,""]
["","",null,null,null,null,null,null,"","","",null,null,null,null,null,null,0,""]
["","",null,null,null,null,null,null,"","","",null,null,null,null,null,null,0,""]
["","",null,null,null,null,null,null,"","","",null,null,null,null,null,null,0,""]
["","",null,null,null,null,null,null,"","","",null,null,null,null,null,null,0,""]
["","",null,null,null,null,null,null,"","","",null,null,null,null,null,null,0,""]
["","",null,null,null,null,null,null,"","","",null,null,null,null,null,null,0,""]
["","",null,null,null,null,null,null,"","","",null,null,null,null,null,null,0,""]
["","",null,null,null,null,null,null,"","","",null,null,null,null,null,null,0,""]
["","",null,null,null,null,null,null,"","","",null,null,null,null,null,null,0,""]
["","",null,null,null,null,null,null,"","","",null,null,null,null,null,null,0,""]
["","",null,null,null,null,null,null,"","","",null,null,null,null,null,null,0,""]
["","",null,null,null,null,null,null,"",{"$f":"IF(G33<>\"\",1,\"\")","v":""},{"$f":"IF(G33<>\"\",\"GLE\",\"\")","v":""},null,null,null,null,null,null,0,""]
["","",null,null,null,null,null,null,"","","",null,null,null,null,null,null,0,""]
["","",null,null,null,null,null,null,"","","",null,null,null,null,null,null,0,""]
[{"$f":"IF(H36<>\"\",\"NDSU1\",\"\")","v":""},"",null,null,null,null,null,null,"","","",null,null,null,null,null,null,0,""]
["","",null,null,null,null,null,null,"","","",null,null,null,null,null,null,0,""]
["","",null,null,null,null,null,null,"","","",null,null,null,null,null,null,0,""]
["","",null,null,null,null,null,null,"","","",null,null,null,null,null,null,0,""]
["","",null,null,null,null,null,null,"","","",null,null,null,null,null,null,0,""]
["","",null,null,null,null,null,null,"","","",null,null,null,null,null,null,0,""]
["","",null,null,null,null,null,null,"","","",null,null,null,null,null,null,0,""]
["","",null,null,null,null,null,null,"","","",null,null,null,null,null,null,0,""]
["","",null,null,null,null,null,null,"","","",null,null,null,null,null,null,0,""]
["","",null,null,null,null,null,null,"","","",null,null,null,null,null,null,0,""]
["","",null,null,null,null,null,null,"","","",null,null,null,null,null,null,0,""]
["","",null,null,null,null,null,null,"","","",null,null,null,null,null,null,0,""]
["","",null,null,null,null,null,null,"","","",null,null,null,null,null,null,0,""]
["","",null,null,null,null,null,null,"","","",null,null,null,null,null,null,0,""]
["","",null,null,null,null,null,null,"","","",null,null,null,null,null,null,0,""]
["","",null,null,null,null,null,null,"","","",null,null,null,null,null,null,0,""]
["","",null,null,null,null,null,null,"","","",null,null,null,null,null,null,0,""]
["","",null,null,null,null,null,null,"","","",null,null,null,null,null,null,0,""]
["","",null,null,null,null,null,null,"","","",null,null,null,null,null,null,0,""]
["","",null,null,null,null,null,null,"","","",null,null,null,null,null,null,0,""]
["","",null,null,null,null,null,null,"","","",null,null,null,null,null,null,0,""]
["","",null,null,null,null,null,null,"","","",null,null,null,null,null,null,0,""]
["","",null,null,null,null,null,null,"","","",null,null,null,null,null,null,0,""]
["","",null,null,null,null,null,null,"","","",null,null,null,null,null,null,0,""]
["","",null,null,null,null,null,null,"","","",null,null,null,null,null,null,0,""]
["","",null,null,null,null,null,null,"","","",null,null,null,null,null,null,0,""]
["","",null,null,null,null,null,null,"","","",null,null,null,null,null,null,0,""]
["","",null,null,null,null,null,null,"","","",null,null,null,null,null,null,0,""]
["","",null,null,null,null,null,null,"","","",null,null,null,null,null,null,0,""]
["","",null,null,null,null,null,null,"","","",null,null,null,null,null,null,0,""]
["","",null,null,null,null,null,null,"","","",null,null,null,null,null,null,0,""]
["","",null,null,null,null,null,null,"","","",null,null,null,null,null,null,0,""]
["","",null,null,null,null,null,null,"","","",null,null,null,null,null,null,0,""]
["","",null,null,null,null,null,null,"","","",null,null,null,null,null,null,0,""]
["","",null,null,null,null,null,null,"","","",null,null,null,null,null,null,0,""]
["","",null,null,null,null,null,null,"","","",null,null,null,null,null,null,0,""]
["","",null,null,null,null,null,null,"","","",null,null,null,null,null,null,0,""]
["","",null,null,null,null,null,null,"","","",null,null,null,null,null,null,0,""]
["","",null,null,null,null,null,null,"","","",null,null,null,null,null,null,0,""]
["","",null,null,null,null,null,null,"","","",null,null,null,null,null,null,0,""]
["","",null,null,null,null,null,null,"","","",null,null,null,null,null,null,0,""]
["","",null,null,null,null,null,null,"","","",null,null,null,null,null,null,0,""]
["","",null,null,null,null,null,null,"","","",null,null,null,null,null,null,0,""]
["","",null,null,null,null,null,null,"","","",null,null,null,null,null,null,0,""]
["","",null,null,null,null,null,null,"","","",null,null,null,null,null,null,0,""]
["","",null,null,null,null,null,null,{"$f":"IF(G81<>\"\",A81,\"\")","v":""},"","",null,null,null,null,null,null,0,""]
["","",null,null,null,null,null,null,"","","",null,null,null,null,null,null,{"$f":"LEN(Q82)","v":0},{"$f":"IF(R82<30,\"\",\"Over 30 Characters\")","v":""}]
["",{"$f":"IF(A83<>\"\",\"ACTUALS\",\"\")","v":""},null,null,null,null,null,null,"","","",null,null,null,null,null,null,0,""]
["","",null,null,null,null,null,null,"","","",null,null,null,null,null,null,0,""]
["","",null,null,null,null,null,null,"","","",null,null,null,null,null,null,0,""]
["","",null,null,null,null,null,null,"","","",null,null,null,null,null,null,0,""]
["","",null,null,null,null,null,null,"","","",null,null,null,null,null,null,0,""]
["","",null,null,null,null,null,null,"","","",null,null,null,null,null,null,0,""]
["","",null,null,null,null,null,null,"","","",null,null,null,null,null,null,0,""]
["","",null,null,null,null,null,null,"","","",null,null,null,null,null,null,0,""]
["","",null,null,null,null,null,null,"","","",null,null,null,null,null,null,0,""]
["","",null,null,null,null,null,null,"","","",null,null,null,null,null,null,0,""]
["","",null,null,null,null,null,null,"","","",null,null,null,null,null,null,0,""]
["","",null,null,null,null,null,null,"","","",null,null,null,null,null,null,0,""]
["","",null,null,null,null,null,null,"","","",null,null,null,null,null,null,0,""]
["","",null,null,null,null,null,null,"","","",null,null,null,null,null,null,0,""]
["","",null,null,null,null,null,null,"",{"$f":"IF(G97<>\"\",1,\"\")","v":""},{"$f":"IF(G97<>\"\",\"GLE\",\"\")","v":""},null,null,null,null,null,null,0,""]
["","",null,null,null,null,null,null,"","","",null,null,null,null,null,null,0,""]
["","",null,null,null,null,null,null,"","","",null,null,null,null,null,null,0,""]
[{"$f":"IF(H100<>\"\",\"NDSU1\",\"\")","v":""},"",null,null,null,null,null,null,"","","",null,null,null,null,null,null,0,""]
["","",null,null,null,null,null,null,"","","",null,null,null,null,null,null,0,""]
["","",null,null,null,null,null,null,"","","",null,null,null,null,null,null,0,""]
["","",null,null,null,null,null,null,"","","",null,null,null,null,null,null,0,""]
["","",null,null,null,null,null,null,"","","",null,null,null,null,null,null,0,""]
["","",null,null,null,null,null,null,"","","",null,null,null,null,null,null,0,""]
["","",null,null,null,null,null,null,"","","",null,null,null,null,null,null,0,""]
["","",null,null,null,null,null,null,"","","",null,null,null,null,null,null,0,""]
["","",null,null,null,null,null,null,"","","",null,null,null,null,null,null,0,""]
["","",null,null,null,null,null,null,"","","",null,null,null,null,null,null,0,""]
["","",null,null,null,null,null,null,"","","",null,null,null,null,null,null,0,""]
["","",null,null,null,null,null,null,"","","",null,null,null,null,null,null,0,""]
["","",null,null,null,null,null,null,"","","",null,null,null,null,null,null,0,""]
["","",null,null,null,null,null,null,"","","",null,null,null,null,null,null,0,""]
["","",null,null,null,null,null,null,"","","",null,null,null,null,null,null,0,""]
["","",null,null,null,null,null,null,"","","",null,null,null,null,null,null,0,""]
["","",null,null,null,null,null,null,"","","",null,null,null,null,null,null,0,""]
["","",null,null,null,null,null,null,"","","",null,null,null,null,null,null,0,""]
["","",null,null,null,null,null,null,"","","",null,null,null,null,null,null,0,""]
["","",null,null,null,null,null,null,"","","",null,null,null,null,null,null,0,""]
["","",null,null,null,null,null,null,"","","",null,null,null,null,null,null,0,""]
["","",null,null,null,null,null,null,"","","",null,null,null,null,null,null,0,""]
["","",null,null,null,null,null,null,"","","",null,null,null,null,null,null,0,""]
["","",null,null,null,null,null,null,"","","",null,null,null,null,null,null,0,""]
["","",null,null,null,null,null,null,"","","",null,null,null,null,null,null,0,""]
["","",null,null,null,null,null,null,"","","",null,null,null,null,null,null,0,""]
["","",null,null,null,null,null,null,"","","",null,null,null,null,null,null,0,""]
["","",null,null,null,null,null,null,"","","",null,null,null,null,null,null,0,""]
["","",null,null,null,null,null,null,"","","",null,null,null,null,null,null,0,""]
["","",null,null,null,null,null,null,"","","",null,null,null,null,null,null,0,""]
["","",null,null,null,null,null,null,"","","",null,null,null,null,null,null,0,""]
["","",null,null,null,null,null,null,"","","",null,null,null,null,null,null,0,""]
["","",null,null,null,null,null,null,"","","",null,null,null,null,null,null,0,""]
["","",null,null,null,null,null,null,"","","",null,null,null,null,null,null,0,""]
["","",null,null,null,null,null,null,"","","",null,null,null,null,null,null,0,""]
["","",null,null,null,null,null,null,"","","",null,null,null,null,null,null,0,""]
["","",null,null,null,null,null,null,"","","",null,null,null,null,null,null,0,""]
["","",null,null,null,null,null,null,"","","",null,null,null,null,null,null,0,""]
["","",null,null,null,null,null,null,"","","",null,null,null,null,null,null,0,""]
["","",null,null,null,null,null,null,"","","",null,null,null,null,null,null,0,""]
["","",null,null,null,null,null,null,"","","",null,null,null,null,null,null,0,""]
["","",null,null,null,null,null,null,"","","",null,null,null,null,null,null,0,""]
["","",null,null,null,null,null,null,"","","",null,null,null,null,null,null,0,""]
["","",null,null,null,null,null,null,"","","",null,null,null,null,null,null,0,""]
["","",null,null,null,null,null,null,"","","",null,null,null,null,null,null,0,""]
["","",null,null,null,null,null,null,{"$f":"IF(G145<>\"\",A145,\"\")","v":""},"","",null,null,null,null,null,null,0,""]
["","",null,null,null,null,null,null,"","","",null,null,null,null,null,null,{"$f":"LEN(Q146)","v":0},{"$f":"IF(R146<30,\"\",\"Over 30 Characters\")","v":""}]
["",{"$f":"IF(A147<>\"\",\"ACTUALS\",\"\")","v":""},null,null,null,null,null,null,"","","",null,null,null,null,null,null,0,""]
["","",null,null,null,null,null,null,"","","",null,null,null,null,null,null,0,""]
["","",null,null,null,null,null,null,"","","",null,null,null,null,null,null,0,""]
["","",null,null,null,null,null,null,"","","",null,null,null,null,null,null,0,""]
["","",null,null,null,null,null,null,"","","",null,null,null,null,null,null,0,""]
["","",null,null,null,null,null,null,"","","",null,null,null,null,null,null,0,""]
["","",null,null,null,null,null,null,"","","",null,null,null,null,null,null,0,""]
["","",null,null,null,null,null,null,"","","",null,null,null,null,null,null,0,""]
["","",null,null,null,null,null,null,"","","",null,null,null,null,null,null,0,""]
["","",null,null,null,null,null,null,"","","",null,null,null,null,null,null,0,""]
["","",null,null,null,null,null,null,"","","",null,null,null,null,null,null,0,""]
["","",null,null,null,null,null,null,"","","",null,null,null,null,null,null,0,""]
["","",null,null,null,null,null,null,"","","",null,null,null,null,null,null,0,""]
["","",null,null,null,null,null,null,"","","",null,null,null,null,null,null,0,""]
["","",null,null,null,null,null,null,"",{"$f":"IF(G161<>\"\",1,\"\")","v":""},{"$f":"IF(G161<>\"\",\"GLE\",\"\")","v":""},null,null,null,null,null,null,0,""]
["","",null,null,null,null,null,null,"","","",null,null,null,null,null,null,0,""]
["","",null,null,null,null,null,null,"","","",null,null,null,null,null,null,0,""]
[{"$f":"IF(H164<>\"\",\"NDSU1\",\"\")","v":""},"",null,null,null,null,null,null,"","","",null,null,null,null,null,null,0,""]
["","",null,null,null,null,null,null,"","","",null,null,null,null,null,null,0,""]
["","",null,null,null,null,null,null,"","","",null,null,null,null,null,null,0,""]
["","",null,null,null,null,null,null,"","","",null,null,null,null,null,null,0,""]
["","",null,null,null,null,null,null,"","","",null,null,null,null,null,null,0,""]
["","",null,null,null,null,null,null,"","","",null,null,null,null,null,null,0,""]
["","",null,null,null,null,null,null,"","","",null,null,null,null,null,null,0,""]
["","",null,null,null,null,null,null,"","","",null,null,null,null,null,null,0,""]
["","",null,null,null,null,null,null,"","","",null,null,null,null,null,null,0,""]
["","",null,null,null,null,null,null,"","","",null,null,null,null,null,null,0,""]
["","",null,null,null,null,null,null,"","","",null,null,null,null,null,null,0,""]
["","",null,null,null,null,null,null,"","","",null,null,null,null,null,null,0,""]
["","",null,null,null,null,null,null,"","","",null,null,null,null,null,null,0,""]
["","",null,null,null,null,null,null,"","","",null,null,null,null,null,null,0,""]
["","",null,null,null,null,null,null,"","","",null,null,null,null,null,null,0,""]
["","",null,null,null,null,null,null,"","","",null,null,null,null,null,null,0,""]
["","",null,null,null,null,null,null,"","","",null,null,null,null,null,null,0,""]
["","",null,null,null,null,null,null,"","","",null,null,null,null,null,null,0,""]
["","",null,null,null,null,null,null,"","","",null,null,null,null,null,null,0,""]
["","",null,null,null,null,null,null,"","","",null,null,null,null,null,null,0,""]
["","",null,null,null,null,null,null,"","","",null,null,null,null,null,null,0,""]
["","",null,null,null,null,null,null,"","","",null,null,null,null,null,null,0,""]
["","",null,null,null,null,null,null,"","","",null,null,null,null,null,null,0,""]
["","",null,null,null,null,null,null,"","","",null,null,null,null,null,null,0,""]
["","",null,null,null,null,null,null,"","","",null,null,null,null,null,null,0,""]
["","",null,null,null,null,null,null,"","","",null,null,null,null,null,null,0,""]
["","",null,null,null,null,null,null,"","","",null,null,null,null,null,null,0,""]
["","",null,null,null,null,null,null,"","","",null,null,null,null,null,null,0,""]
["","",null,null,null,null,null,null,"","","",null,null,null,null,null,null,0,""]
["","",null,null,null,null,null,null,"","","",null,null,null,null,null,null,0,""]
["","",null,null,null,null,null,null,"","","",null,null,null,null,null,null,0,""]
["","",null,null,null,null,null,null,"","","",null,null,null,null,null,null,0,""]
["","",null,null,null,null,null,null,"","","",null,null,null,null,null,null,0,""]
["","",null,null,null,null,null,null,"","","",null,null,null,null,null,null,0,""]
["","",null,null,null,null,null,null,"","","",null,null,null,null,null,null,0,""]
["","",null,null,null,null,null,null,"","","",null,null,null,null,null,null,0,""]
["","",null,null,null,null,null,null,"","","",null,null,null,null,null,null,0,""]
{"$rows_left_out":1803}
{"sheet":"Instructions","index":1,"n_rows":4,"n_cols":2,"rows_kept":4,"cut":false,"hidden":true,"merged":[]}
["Journal ID:","A journal entry reference ID that includes a combination of letters and/or numbers\nOnly a max of 10 characters can be used\nAll journal imports must have a Journal ID"]
["Purpose:","A detailed description on the purpose of the journal\nAll journal imports must have a Purpose listed."]
["Period\nCovered:","An extent of time associated with the purpose of the journal.\nExample: If correcting entries that occurred in September 2010, indicate that for the Period Covered."]
["Business Unit:","Always NDSU1 for North Dakota State University"]

{"sheet":"List","index":2,"n_rows":6,"n_cols":4,"rows_kept":6,"cut":false,"hidden":true,"merged":[]}
["Choose Type","Choose Type","Please Choose Type from Drop Down","Please Choose Type from Drop Down.  Spreadsheet will be returned if a type is not selected."]
["Cash Transfer ","Cash Transfer ","Cash Transfers are transfers of cash between local funds that do not involve the exchange of goods and services. (ex. A cash transfer from one local fund to help cover operating expenses or a fund deficit in another local fund).  Do Not use for appropriated funds.","Be as descriptive as possible to explain why the transfer is necessary.  Include the original voucher/journal id #'s and original dates as entered in the general ledger of PeopleSoft.  The department transferring the cash should only use account code 722005.  The department receiving the cash transfer should only use account code 490002."]
["Correct Entry","Correct Entry","Correcting Entries are entries that correct coding errors on past transactions that have posted to the general ledger in PeopleSoft. Corrections to Accounts Payable, Travel Vouchers and JP Morgan Purchasing transactions will need to be completed on a Journal Voucher form.  They cannot be completed on this Spreadsheet Journal Template.","Be as descriptive as possible to explain why the correction to the past transaction is necessary.  (ex. Correct funding error on FAMIS2/6-28-16, incorrect account code was used for W0123456).  Include the original journal id(s) and original date(s) as entered in the general ledger of PeopleSoft."]
["Cost Transfer ","Cost Transfer ","Cost Transfers are when one fund has incurred an expense that will then be re-allocated to another fund(s).","Be as descriptive as possible to explain why the transfer is necessary and a description of the goods/services being transferred.  (ex. Reallocate cost of services & calibration of balances, scales & pipettes billed on NBS Calibration Inv # 123456 and paid on APV # 00654321 dated 8-15-12).  Include the original voucher/journal id #'s and original dates as entered in the general ledger of PeopleSoft."]
["Inter Department Billing","IDB","IDB's are the transferring of money for goods and services being billed by one NDSU department to another NDSU department.","Be as descriptive as possible as to what you are charging the other department for. (ex. Memorial Union event services billing, INV # MUS1234 Dated 9-1-12, Great Room for fall staff training on 8-15-12).  Complete the ‘Description’ column to provide an additional description if necessary. (ex. separate each good/service and the amount to help identify). The only revenue account codes used should be 479005, 479010, 479015 or 479020."]
["Other","Other","Other entries are entries that do not fall into either of the other four categories. (Cash Transfer, Correct Entry, Cost Transfer or Inter Department Billing).","Be descriptive as possible and reference any applicable supporting documentation."]